Acteurs intervenant dans le processus législatif
type: ConceptScheme
has top concept: Conférence des Présidents

Conférence des Présidents
type: Concept
start date: 2016-08-30T00:00:00Z
status: CURRENT
created: 2016-01-01T00:00:00Z
deprecated: false @en
definition: Conférence des Présidents de la Chambre des Députés
hidden label: CP
in scheme: Acteurs intervenant dans le processus législatif
notation: CP
top concept of: Acteurs intervenant dans le processus législatif

Collection pour la gestion des traités
type: Collection
member: Conférence des Présidents

Collection des organismes consultatifs
type: Collection
member: Conférence des Présidents