Langues
type: ConceptScheme
has top concept: malais

malais
type: Concept
created: 2016-01-01T00:00:00Z
status: CURRENT
in scheme: Langues
top concept of: Langues
deprecated: false @en
notation: zlm
definition: Malay is a major language of the Austronesian family. The Standard Malay has various official names; in Singapore and Brunei this individual language is called Bahasa Melayu (Malay). Malay is written using the Arabic or the Latin script.