Langues
type: ConceptScheme
has top concept: flamand

flamand
type: Concept
created: 2016-01-01T00:00:00Z
status: CURRENT
in scheme: Langues
top concept of: Langues
deprecated: false @en
notation: nl
notation: vls
definition: Le flamand (vlaams) ou belge néerlandais est la langue néerlandaise parlée en Flandre, la partie nord de la Belgique. Les différences entre le flamand et le néerlandais sont minimes. L’utilisation du flamand comme langue officielle en Flandre est trompeuse: la seule langue officielle en Flandre est le néerlandais standard.