Langues
type: ConceptScheme
has top concept: tigrigna

tigrigna
type: Concept
created: 2016-01-01T00:00:00Z
status: CURRENT
in scheme: Langues
top concept of: Langues
deprecated: false @en
notation: tir
notation: ti
definition: Le tigrigna ou tigrinya est une langue éthiosémitique parlée essentiellement au nord-est de la Corne de l’Afrique. Le tigrigna s’écrit au moyen d’une version de l’alphasyllabaire guèze auquel s’ajoutent quelques caractères.