Langues
type: ConceptScheme
has top concept: serbe

serbe
type: Concept
created: 2016-01-01T00:00:00Z
status: CURRENT
in scheme: Langues
top concept of: Langues
deprecated: false @en
notation: srp
notation: sr
definition: Le serbe est la variante standard de la langue serbo-croate, parlée principalement en Serbie, en Bosnie-Herzégovine et au Monténégro. Sa norme est basée sur le dialecte chtokavien du serbo-croate. Le serbe utilise les alphabets cyrillique et latin.