Langues
type: ConceptScheme
has top concept: somali

somali
type: Concept
created: 2016-01-01T00:00:00Z
status: CURRENT
in scheme: Langues
top concept of: Langues
deprecated: false @en
notation: som
notation: so
definition: Le somali est une langue parlée dans la Corne de l’Afrique. Il appartient à la branche couchitique de la famille chamito-sémitique (également dite afro-asiatique). Différents systèmes d’écriture ont été utilisés pour transcrire le somali. L’alphabet latin somali est aujourd’hui le système d’écriture du somali le plus répandu.