Langues
type: ConceptScheme
has top concept: scots

scots
type: Concept
created: 2016-01-01T00:00:00Z
status: CURRENT
in scheme: Langues
top concept of: Langues
deprecated: false @en
notation: sco
definition: Le scots est une langue germanique parlée en Écosse et dans le nord de l’Irlande. Il est reconnu par le Royaume-Uni comme langue régionale de l’Écosse, selon la charte européenne des langues régionales ou minoritaires.