Langues
type: ConceptScheme
has top concept: sango

sango
type: Concept
created: 2016-01-01T00:00:00Z
status: CURRENT
in scheme: Langues
top concept of: Langues
deprecated: false @en
notation: sg
notation: sag
definition: Sango is a Ngbandi-based creole language. It is one of the official languages of the Central African Republic.