Langues
type: ConceptScheme
has top concept: roumain

roumain
type: Concept
created: 2016-01-01T00:00:00Z
status: CURRENT
in scheme: Langues
top concept of: Langues
deprecated: false @en
notation: ron
notation: ro
definition: Le roumain est une langue romane parlée principalement en Roumanie et en Moldavie. Une grande partie du vocabulaire roumain total est dérivée du latin. Le roumain possède quatre dialectes: le daco-roumain, l’istro-roumain, l’aroumain et le mégléno-roumain.