portugais
type: Concept
created: 2016-01-01T00:00:00Z
status: CURRENT
in scheme: Langues
top concept of: Langues
deprecated: false @en
notation: pt
notation: por
definition: Le portugais est une langue appartenant au sous-groupe ibéro-roman des langues romanes. Il est parlé au Portugal, au Brésil, au Mozambique, en Angola, au Cap-Vert, en Guinée-Bissau, à Sao Tomé-et-Principe, à Macao (Chine), en Guinée équatoriale et au Timor-Oriental. Le portugais est la langue la plus parlée de l’hémisphère Sud.

Langues
type: ConceptScheme
has top concept: portugais