Langues
type: ConceptScheme
has top concept: occitan

occitan
type: Concept
created: 2016-01-01T00:00:00Z
status: CURRENT
in scheme: Langues
top concept of: Langues
deprecated: false @en
notation: oc
notation: oci
definition: L’occitan est le nom générique pour les idiomes romans originaires principalement du sud de la France. Il y a polémique sur l’unité de la langue, certains pensant que l’occitan est une macrolangue. Il n’y a pas de langue écrite standard intitulée «occitan», et l’occitan n’a pas de statut officiel en France, qui abrite la majeure partie de l’Occitanie.