Langues
type: ConceptScheme
has top concept: maltais

maltais
type: Concept
created: 2016-01-01T00:00:00Z
status: CURRENT
in scheme: Langues
top concept of: Langues
deprecated: false @en
notation: mt
notation: mlt
definition: Le maltais est une langue sémitique, historiquement un dialecte de l’arabe, parlé à Malte. Environ la moitié du vocabulaire est dérivé de l’italien standard et de Sicile; les mots anglais constituent également une partie importante du vocabulaire maltais. Il est la seule langue sémitique écrite en alphabet latin dans sa forme standard.