Langues
type: ConceptScheme
has top concept: malgache

malgache
type: Concept
created: 2016-01-01T00:00:00Z
status: CURRENT
in scheme: Langues
top concept of: Langues
deprecated: false @en
notation: mlg
notation: mg
definition: Le malgache ou malagasy est la langue nationale de Madagascar. C’est depuis toujours une langue normalisée, principalement dérivée du dialecte parlé sur les hauts plateaux centraux. Elle est la plus occidentale des langues malayo-polynésiennes et donc des langues austronésiennes. Plus précisément, elle appartient au rameau dit «Grand Barito». Dans cette région, la langue dominante est aujourd’hui le malais, qui appartient à un autre rameau malayo-polynésien. Le malgache est également utilisé à Mayotte sous le nom de «kibushi» ou «bushi».