Langues
type: ConceptScheme
has top concept: macédonien

macédonien
type: Concept
created: 2016-01-01T00:00:00Z
status: CURRENT
in scheme: Langues
top concept of: Langues
deprecated: false @en
notation: mkd
notation: mk
definition: Le macédonien est une langue appartenant au sous-groupe méridional des langues slaves, parlée principalement dans l’ancienne République yougoslave de Macédoine. Le nom de la langue macédonienne est un sujet de controverse politique en Grèce, ainsi que sa particularité par rapport au bulgare en Bulgarie.