Langues
type: ConceptScheme
has top concept: minangkabau

minangkabau
type: Concept
created: 2016-01-01T00:00:00Z
status: CURRENT
in scheme: Langues
top concept of: Langues
deprecated: false @en
notation: min
definition: Le minangkabau est une langue austronésienne parlée en Indonésie, dans le nord de l’île de Sumatra. Il fait partie des langues malaïques qui représentent un des sous-groupes du malayo-polynésien occidental.