Langues
type: ConceptScheme
has top concept: letton

letton
type: Concept
created: 2016-01-01T00:00:00Z
status: CURRENT
in scheme: Langues
top concept of: Langues
deprecated: false @en
notation: lv
notation: lav
definition: Le letton ou lette est l’un des deux membres vivants des langues baltes, l’autre étant le lituanien. C’est la langue officielle de la Lettonie. Le letton est plus novateur, en particulier dans la morphologie, que le lituanien.