Langues
type: ConceptScheme
has top concept: groenlandais

groenlandais
type: Concept
created: 2016-01-01T00:00:00Z
status: CURRENT
in scheme: Langues
top concept of: Langues
deprecated: false @en
notation: kl
notation: kal
definition: Le groenlandais (kalaallisut) est une langue eskimo-aléoute parlée par un petit groupe de personnes inuites, en général bilingues danois-groenlandais, au Groenland. Il est très proche des langues inuites au Canada. Le groenlandais est une langue polysynthétique qui permet la création de longs mots en enchaînant les racines et les suffixes. Les noms et les verbes ont également une morphologie dérivationnelle complexe.