Langues
type: ConceptScheme
has top concept: italien

italien
type: Concept
created: 2016-01-01T00:00:00Z
status: CURRENT
in scheme: Langues
top concept of: Langues
deprecated: false @en
notation: it
notation: ita
definition: L’italien est une langue appartenant au groupe des langues romanes, parlée principalement en Europe du Sud. Parmi les langues romanes, l’italien est très proche du latin en termes de vocabulaire. La langue italienne adoptée par l’État après l’unification de l’Italie est fondée sur le dialecte de la Toscane. De nombreux locuteurs italiens sont bilingues et parlent aussi bien l’italien standard que les autres variantes régionales.