Langues
type: ConceptScheme
has top concept: haut-sorabe

haut-sorabe
type: Concept
created: 2016-01-01T00:00:00Z
status: CURRENT
in scheme: Langues
top concept of: Langues
deprecated: false @en
notation: hsb
definition: Le haut-sorabe est une langue parlée en Allemagne, dans la province historique de Lusace, aujourd'hui en Saxe. Il appartient à la famille occidentale des langues slaves.