Langues
type: ConceptScheme
has top concept: croate

croate
type: Concept
created: 2016-01-01T00:00:00Z
status: CURRENT
in scheme: Langues
top concept of: Langues
deprecated: false @en
notation: hrv
notation: hr
definition: Le croate est la variante standard de la langue serbo-croate utilisée par les Croates, principalement en Croatie et en Bosnie-Herzégovine. Sa norme est basée sur le dialecte chtokavien du serbo-croate. Le croate utilise exclusivement l’alphabet latin.