Langues
type: ConceptScheme
has top concept: hébreu

hébreu
type: Concept
created: 2016-01-01T00:00:00Z
status: CURRENT
in scheme: Langues
top concept of: Langues
deprecated: false @en
notation: he
notation: heb
definition: L’hébreu est une langue sémitique du Nord-Ouest de la famille des langues afro-asiatiques, utilisée depuis les temps bibliques par les Juifs. Il a été relancé en tant que langue parlée et littéraire au XIXe siècle. L’hébreu moderne est une des deux langues officielles d’Israël (l’autre étant l’arabe), tandis que l’hébreu classique est utilisé pour la prière ou l’étude au sein des communautés juives dans le monde d’aujourd’hui. L’hébreu a toujours utilisé un alphabet hébreu.