Langues
type: ConceptScheme
has top concept: galicien

galicien
type: Concept
created: 2016-01-01T00:00:00Z
status: CURRENT
in scheme: Langues
top concept of: Langues
deprecated: false @en
notation: gl
notation: glg
definition: Le galicien (galego) est une langue indo-européenne de la branche ibéro-romane occidentale, très proche du portugais. Il est principalement parlé dans la région autonome de Galice, située dans le nord-ouest de l’Espagne.