Langues
type: ConceptScheme
has top concept: frison

frison
type: Concept
created: 2016-01-01T00:00:00Z
status: CURRENT
in scheme: Langues
top concept of: Langues
deprecated: false @en
notation: fry
notation: fy
definition: Le frison appartient, avec l’anglais, au sous-groupe de la mer du Nord des langues germaniques de l’Ouest. Il est parlé par des groupes ethniques de la Frise, qui vivent principalement dans la partie nord des Pays-Bas. Il est réparti en trois variantes: le frison occidental, le frison oriental et le frison septentrional.