Langues
type: ConceptScheme
has top concept: basque

basque
type: Concept
created: 2016-01-01T00:00:00Z
status: CURRENT
in scheme: Langues
top concept of: Langues
deprecated: false @en
notation: eu
notation: eus
definition: Le basque (euskara) est une langue non indo-européenne d’origine incertaine et la seule langue vivante de l’Europe qui n’a pas de parents linguistiques connus. Il s’agit de la langue parlée par le peuple basque, qui est indigène et habite principalement au Pays basque, région couvrant une zone dans le nord-ouest de l’Espagne et le sud-ouest de la France.