Langues
type: ConceptScheme
has top concept: mandarin

mandarin
type: Concept
created: 2016-01-01T00:00:00Z
status: CURRENT
in scheme: Langues
top concept of: Langues
deprecated: false @en
notation: cmn
definition: Le mandarin, est une catégorie des langues chinoises parlée dans le nord et le sud-ouest de la Chine continentale. Envisagée comme une langue, c'est celle qui compte le plus grand nombre de locuteurs dans le monde.