Langues
type: ConceptScheme
has top concept: tibétain

tibétain
type: Concept
created: 2016-01-01T00:00:00Z
status: CURRENT
in scheme: Langues
top concept of: Langues
deprecated: false @en
notation: bo
notation: bod
definition: Le tibétain est une langue parlée par plusieurs millions de locuteurs dans l’ancien Tibet, c’est-à-dire la Région autonome du Tibet, les zones à population tibétaine du Qinghai (Amdo), du Gansu, du Sichuan et du Yunnan (Kham) en République populaire de Chine, et dans certaines régions des pays environnants, de l’Himalaya et de l’Asie centrale, comme le Ladakh et le Sikkim en Inde, le Baltistan pakistanais, le Bhoutan et le nord du Népal. Le tibétain est une langue appartenant à la famille des langues tibéto-birmanes. Il se subdivise en un grand nombre de dialectes. L’écriture Phagspa, alphasyllabaire, fut créée comme écriture unifiée pour toutes les langues de l’Empire mongol. Le lama Phagspa la dériva de son écriture natale, l’écriture tibétaine.