Langues
type: ConceptScheme
has top concept: zoulou

zoulou
type: Concept
created: 2016-01-01T00:00:00Z
status: CURRENT
in scheme: Langues
top concept of: Langues
deprecated: false @en
notation: zu
notation: zul
definition: Le zoulou est une langue appartenant au groupe nguni des langues bantoues (qui comprend également le xhosa et le ndébélé). C’est l’une des langues les plus répandues en Afrique. Le zoulou, comme toutes les langues indigènes d’Afrique du Sud, était une langue orale jusqu’à l'arrivée de missionnaires européens, qui l’ont transcrit en utilisant l’alphabet latin.