Langues
type: ConceptScheme
has top concept: chinois

chinois
type: Concept
created: 2016-01-01T00:00:00Z
status: CURRENT
in scheme: Langues
top concept of: Langues
deprecated: false @en
notation: zho
notation: zh
definition: Les langues chinoises ou langues sinitiques, souvent désignées dans leur ensemble sous le nom de «chinois» (zhōngwén), appartiennent à la famille des langues sino-tibétaines. Dans leur caractère le plus universel, on considère la langue écrite, transcendant la prononciation des divers parlers. La langue parlée dans son caractère le plus général est le plus souvent appelée «hanyu», même si d’autres groupes ethniques ont progressivement adopté cette langue.