Langues
type: ConceptScheme
has top concept: yiddish

yiddish
type: Concept
created: 2016-01-01T00:00:00Z
status: CURRENT
in scheme: Langues
top concept of: Langues
deprecated: false @en
notation: yid
notation: yi
definition: Le yiddish est une langue germanique, la langue historique des Juifs ashkénazes d’Europe centrale et orientale. Il est traditionnellement écrit dans une variante entièrement vocalisée de l’écriture hébraïque. Une transcription en alphabet latin est très souvent utilisée.