Langues
type: ConceptScheme
has top concept: wallon

wallon
type: Concept
created: 2016-01-01T00:00:00Z
status: CURRENT
in scheme: Langues
top concept of: Langues
deprecated: false @en
notation: wa
notation: wln
definition: Le wallon est une langue romane, une langue d’oïl autochtone dans la plus grande partie de la Wallonie, la partie sud de Belgique parlant français. De nombreuses associations travaillent à garder la langue vivante. Au niveau du gouvernement, le wallon est officiellement reconnu comme une langue autochtone régionale.