Langues
type: ConceptScheme
has top concept: ouzbek

ouzbek
type: Concept
created: 2016-01-01T00:00:00Z
status: CURRENT
in scheme: Langues
top concept of: Langues
deprecated: false @en
notation: uz
notation: uzb
definition: L’ouzbek est une langue appartenant au groupe des langues turques de la famille des langues altaïques. Il est surtout utilisé en Asie centrale, principalement en Ouzbékistan. L’alphabet ouzbek fut perso-arabe, latin, cyrillique et, à partir de 1992, à nouveau latin mais remanié. De nos jours, l’écriture en ouzbek cyrillique reste encore très largement employée. Les Ouzbeks de Chine utilisent un alphabet arabe modifié.