Langues
type: ConceptScheme
has top concept: turc

turc
type: Concept
created: 2016-01-01T00:00:00Z
status: CURRENT
in scheme: Langues
top concept of: Langues
deprecated: false @en
notation: tr
notation: tur
definition: Le turc est la plus parlée des langues turques en Europe du Sud et en Asie occidentale. Il est très proche de l’azéri et du turkmène. En 1928, l’une des réformes d’Atatürk fut de remplacer l’écriture arabe par l’alphabet latin.