Langues
type: ConceptScheme
has top concept: tadjik

tadjik
type: Concept
created: 2016-01-01T00:00:00Z
status: CURRENT
in scheme: Langues
top concept of: Langues
deprecated: false @en
notation: tg
notation: tgk
definition: Le tadjik ou tadjike est une langue appartenant au groupe iranien de la famille des langues indo-européennes. Cette langue est proche du persan et du dari. Le tadjik est parlé en Asie centrale, principalement au Tadjikistan (dont il est la langue officielle), et par des minorités linguistiques en Afghanistan, en Iran, en Ouzbékistan et dans le Xinjiang, région autonome de Chine. Au Tadjikistan et en Ouzbékistan, la langue s’écrit au moyen d’un alphabet cyrillique augmenté de signes diacritiques. En revanche, dans les autres pays, elle est transcrite au moyen de l’alphabet perso-arabe.