Langues
type: ConceptScheme
has top concept: tamoul

tamoul
type: Concept
created: 2016-01-01T00:00:00Z
status: CURRENT
in scheme: Langues
top concept of: Langues
deprecated: false @en
notation: ta
notation: tam
definition: Le tamoul ou tamil est la langue des Tamouls, parlée dans l’Asie du Sud-Est. Le tamoul appartient à la famille des langues dravidiennes. C’est une des plus anciennes langues toujours parlées, restée quasi inchangée depuis environ 2 000 ans. Il s’écrit au moyen d’un alphasyllabaire dérivé du grantha.