Langues
type: ConceptScheme
has top concept: cingalais

cingalais
type: Concept
created: 2016-01-01T00:00:00Z
status: CURRENT
in scheme: Langues
top concept of: Langues
deprecated: false @en
notation: sin
notation: si
definition: Le cingalais est une langue appartenant au groupe indo-aryen de la famille des langues indo-européennes. Il est parlé à Sri Lanka. L’alphabet cingalais compte environ 50 lettres dont quelques-unes sont rarement utilisées dans l’écriture moderne.