Langues
type: ConceptScheme
has top concept: polonais

polonais
type: Concept
created: 2016-01-01T00:00:00Z
status: CURRENT
in scheme: Langues
top concept of: Langues
deprecated: false @en
notation: pl
notation: pol
definition: Le polonais fait partie de la branche léchitique des langues slaves de l’Ouest. Il est parlé principalement en Pologne. Le polonais est la deuxième langue slave la plus utilisée après le russe.