néerlandais
type: Concept
created: 2016-01-01T00:00:00Z
status: CURRENT
in scheme: Langues
top concept of: Langues
deprecated: false @en
notation: nl
notation: nld
definition: Le néerlandais est une langue germanique occidentale, dont le plus proche parent est l’allemand. Elle est parlée aux Pays-Bas, en Belgique (par environ 60 % de la population), au Suriname et dans les pays insulaires des Caraïbes (Aruba, Curaçao et Sint-Maarten). La version du néerlandais parlé en Afrique du Sud a été normalisée comme l’afrikaans.

Langues
type: ConceptScheme
has top concept: néerlandais