Langues
type: ConceptScheme
has top concept: luxembourgeois

luxembourgeois
type: Concept
created: 2016-01-01T00:00:00Z
status: CURRENT
in scheme: Langues
top concept of: Langues
deprecated: false @en
notation: lb
notation: ltz
definition: Le luxembourgeois est une langue germanique qui appartient au sous-groupe du moyen francique de dialectes allemands. Le luxembourgeois est parlé principalement dans le Grand-Duché de Luxembourg.