Langues
type: ConceptScheme
has top concept: lituanien

lituanien
type: Concept
created: 2016-01-01T00:00:00Z
status: CURRENT
in scheme: Langues
top concept of: Langues
deprecated: false @en
notation: lt
notation: lit
definition: Le lituanien est l’un des deux membres vivants des langues baltes, l’autre étant le letton. C’est la langue officielle de la Lituanie. Le lituanien est souvent dit la langue indo-européenne vivante la plus conservatrice, gardant de nombreuses caractéristiques de l’indo-européen aujourd’hui perdues dans d’autres langues indo-européennes.