Langues
type: ConceptScheme
has top concept: kirghiz

kirghiz
type: Concept
created: 2016-01-01T00:00:00Z
status: CURRENT
in scheme: Langues
top concept of: Langues
deprecated: false @en
notation: kir
notation: ky
definition: Le kirghiz ou kirghize est une langue appartenant au groupe des langues turques de la famille des langues altaïques. Il est parlé en Asie centrale, principalement au Kirghizstan (où il est la langue nationale), au Tadjikistan, au Xinjiang et en Afghanistan. On l’écrit au moyen de l’alphabet cyrillique, auquel trois lettres sont ajoutées, mais le kirghiz est parfois écrit en utilisant l’alphabet arabe, lui aussi complété. Le kirghiz est très proche du kazakh. Il est habituellement classé avec celui-ci ainsi que le tatar et le karakalpak au sein du groupe des langues kiptchak (ou branche turque occidentale).