Langues
type: ConceptScheme
has top concept: kazakh

kazakh
type: Concept
created: 2016-01-01T00:00:00Z
status: CURRENT
in scheme: Langues
top concept of: Langues
deprecated: false @en
notation: kaz
notation: kk
definition: Le kazakh est une langue appartenant à la famille des langues turques. Il est parlé en Asie centrale, principalement au Kazakhstan, où il est la langue nationale, et au Xinjiang. Le kazakh est écrit de différentes manières: en utilisant une variante de l’alphabet latin proche de celle utilisée en turc, l’alphabet arabe modifié (en Chine, en Iran, dans une petite partie de la Mongolie, en Afghanistan) et le cyrillique agrémenté de 9 lettres supplémentaires, qui est l’écriture officielle au Kazakhstan. Le kazakh est particulièrement proche du kirghiz.