Langues
type: ConceptScheme
has top concept: japonais

japonais
type: Concept
created: 2016-01-01T00:00:00Z
status: CURRENT
in scheme: Langues
top concept of: Langues
deprecated: false @en
notation: jpn
notation: ja
definition: Le japonais est la langue du Japon, parlée par le peuple japonais. Le japonais appartient à la famille isolée des langues japoniques. La langue japonaise utilise conjointement deux ensembles de caractères distincts: les kanjis, écriture logographique d’origine chinoise, et les kanas, système moraïque dérivé des kanjis. Les kanas se divisent eux-mêmes en deux groupes, les hiraganas et les katakanas. Les katakanas sont employés pour l’écriture de mots d’origine étrangère au Japon, et les hiraganas, pour noter la plupart des mots et affixes grammaticaux.