Langues
type: ConceptScheme
has top concept: interlingua

interlingua
type: Concept
created: 2016-01-01T00:00:00Z
status: CURRENT
in scheme: Langues
top concept of: Langues
deprecated: false @en
notation: ina
notation: ia
definition: L’interlingua désigne aujourd’hui la langue construite élaborée par l’International Auxiliary Language Association (IALA). La construction de l’interlingua par l’IALA fut achevée en 1951. Le vocabulaire de l’interlingua est emprunté essentiellement aux langues romanes ainsi qu’à l’anglais du fait qu’une grande partie de son vocabulaire est d’origine romane. La grammaire est également inspirée de ces langues, mais avec des simplifications. Il existe aujourd’hui une Union mondiale pour l’interlingua (Union Mundial pro Interlingua), qui compte des adhérents dans le monde entier. On trouve aussi une abondante littérature en interlingua, ainsi que des sites internet et des revues.