Langues
type: ConceptScheme
has top concept: hongrois

hongrois
type: Concept
created: 2016-01-01T00:00:00Z
status: CURRENT
in scheme: Langues
top concept of: Langues
deprecated: false @en
notation: hun
notation: hu
definition: Le hongrois (magyar), comme l’estonien et le finnois, appartient à la branche finno-ougrienne de la famille des langues ouraliennes. Il est la langue officielle de la Hongrie et est également parlé par les communautés hongroises dans les pays voisins. En hongrois, les noms de famille précèdent les prénoms.