Langues
type: ConceptScheme
has top concept: hindi

hindi
type: Concept
created: 2016-01-01T00:00:00Z
status: CURRENT
in scheme: Langues
top concept of: Langues
deprecated: false @en
notation: hi
notation: hin
definition: Le hindi est la plus parlée des langues de l’Inde. Utilisée essentiellement dans le nord et le centre de l’Inde, c’est une langue indo-européenne de la branche des langues indo-aryennes, qui en est la plus vaste famille, dérivée du sanskrit et de divers prâkrits, écrite la plupart du temps au moyen de l’alphasyllabaire devanāgarī, qui se lit et s’écrit de gauche à droite. L’ourdou est le nom pakistanais du hindi. Le hindi et l’ourdou sont parfaitement intercompréhensibles et, avant la partition de 1947 entre l’Inde et le Pakistan, constituaient une seule et même langue, appelée «hindoustani».