Langues
type: ConceptScheme
has top concept: serbo-croate

serbo-croate
type: Concept
created: 2016-01-01T00:00:00Z
status: CURRENT
in scheme: Langues
top concept of: Langues
deprecated: false @en
notation: sh
notation: hbs
definition: Le serbo-croate, aussi appelé «serbo-croate-bosniaque» (SCB) ou «bosniaque-croate-serbe» (BCS), est une langue slave du Sud et la principale langue de la Serbie, de la Croatie, de la Bosnie-Herzégovine et du Monténégro. C’est une langue pluricentrique avec quatre variantes standards mutuellement intelligibles. Le terme «serbo-croate» a été largement utilisé dans l’ex-Yougoslavie. Pour écrire en serbo-croate, les alphabets latin et cyrillique sont indifféremment utilisés et facilement interchangeables.