français
type: Concept
created: 2016-01-01T00:00:00Z
status: CURRENT
in scheme: Langues
top concept of: Langues
deprecated: false @en
notation: fr
notation: fra
definition: Le français est la plus septentrionale des langues romanes et est une langue officielle dans 29 pays. Il est aussi une langue officielle de tous les organismes des Nations unies et d’un grand nombre d’organisations internationales. Hors de France, le plus grand nombre de francophones se trouvent au Canada, en Belgique, en Suisse et au Luxembourg.

Langues
type: ConceptScheme
has top concept: français