Langues
type: ConceptScheme
has top concept: grec

grec
type: Concept
created: 2016-01-01T00:00:00Z
status: CURRENT
in scheme: Langues
top concept of: Langues
deprecated: false @en
notation: ell
notation: el
definition: Le grec fait partie de la branche indépendante de la famille indo-européenne des langues, principalement parlé dans le sud des Balkans, sur les îles de la mer Égée, en Asie Mineure occidentale et à Chypre. Il a la plus longue histoire enregistrée en continu de toutes les langues européennes. Son système d’écriture a été l’alphabet grec pour la majorité de son histoire. Les racines grecques sont souvent utilisées pour créer de nouveaux mots dans d’autres langues; le grec et le latin sont les principales sources de vocabulaire scientifique international.