allemand
type: Concept
created: 2016-01-01T00:00:00Z
status: CURRENT
in scheme: Langues
top concept of: Langues
deprecated: false @en
notation: de
notation: deu
definition: L’allemand est une langue germanique occidentale, proche du néerlandais et du yiddish. L’allemand est une langue pluricentrique, avec plusieurs pays ayant leurs propres variantes normalisées ainsi que de nombreux dialectes. Il existe aussi une variante dénommée «allemand standard».

Langues
type: ConceptScheme
has top concept: allemand