Langues
type: ConceptScheme
has top concept: corse

corse
type: Concept
created: 2016-01-01T00:00:00Z
status: CURRENT
in scheme: Langues
top concept of: Langues
deprecated: false @en
notation: co
notation: cos
definition: Le corse est une langue italo-dalmate romane, membre du groupe centre-sud des dialectes de l’Italie, parlée et écrite sur l’île de Corse (France) et au nord de la Sardaigne (Italie). L’Unesco classe le corse comme une langue définitivement en voie de disparition.